Android Studio, будь он не ладен.
Добавлено: 04 июн 2015, 08:47
Здравствуйте. Помогите пожалуйста, не знаю, что уже и делать. Решил перенести проект в Android Studio из Eclipse. Автоматически не получилось, ну и ладно - переписал в AS заново. Проект не очень большой, но используются библиотеки - android-support-v4.jar, google-play-services.jar и nineoldandroids.jar. Перерыл кучу "гуглов-яндексов", поместил файлы библиотек в папку libs, которая в папке app проекта. Ошибок в java-модулях нету, в xml-layout-ах тоже нету. Но при попытке запустить на утройстве ошибка:
Error:Execution failed for task ':app:dexDebug'.
> com.android.ide.common.process.ProcessException: org.gradle.process.internal.ExecException: Process 'command '/Library/Java/JavaVirtualMachines/jdk1.8.0_45.jdk/Contents/Home/bin/java'' finished with non-zero exit value 2
Information:BUILD FAILED
Если в build.gradle я вставляю - multiDexEnabled true, то ошибка другая:
Error:Execution failed for task ':app:packageAllDebugClassesForMultiDex'.
> java.util.zip.ZipException: duplicate entry: android/support/v4/util/TimeUtils.class
Подскажите, пожалуйста, что можно попробовать? Если надо выложить что-нибудь - файлы какие-нибудь или кусочки кода для понимания проблемы - напишите, я выложу. Заранее спасибо..
Error:Execution failed for task ':app:dexDebug'.
> com.android.ide.common.process.ProcessException: org.gradle.process.internal.ExecException: Process 'command '/Library/Java/JavaVirtualMachines/jdk1.8.0_45.jdk/Contents/Home/bin/java'' finished with non-zero exit value 2
Information:BUILD FAILED
Если в build.gradle я вставляю - multiDexEnabled true, то ошибка другая:
Error:Execution failed for task ':app:packageAllDebugClassesForMultiDex'.
> java.util.zip.ZipException: duplicate entry: android/support/v4/util/TimeUtils.class
Подскажите, пожалуйста, что можно попробовать? Если надо выложить что-нибудь - файлы какие-нибудь или кусочки кода для понимания проблемы - напишите, я выложу. Заранее спасибо..